{"text_format":"1","workbook":"xlsx","n_sheets":3,"sheets":["①手順書(ご一読ください)","②リスト(1つの機器につき1行ご記入下さい)","③依頼伝票(印刷の上、現品と一緒にご送付下さい）"],"not_rendered":{"charts":0,"images":3,"macros":1,"external_links":0,"defined_names":1,"comments":1,"pivot_tables":0},"unopened":[],"bounds":{"document_bytes":16777216,"sheet_cells":100000,"rows_first":2000,"rows_last":500,"rows_between":2000,"halvings":0,"cell_chars":16384,"cell_head_chars":4096},"cells_cut":0,"cells_raw":0,"read":"whole","date_system":"1900"}

{"sheet":"①手順書(ご一読ください)","index":0,"n_rows":31,"n_cols":3,"rows_kept":31,"cut":false,"hidden":false,"merged":[[15,0,15,1]]}
["●校正のご依頼の流れ"]
[]
["1.「御取引先登録票」をご記入の上、ご返送下さい。"]
["   *弊社とのお取引が初めてのお客様のみ"]
[]
["2.「校正依頼票」をご記入の上、\"Excelのまま\"ご返送下さい。"]
[]
["3.弊社で1.2.の内容を確認させて頂きます。"]
[]
["4.\"校正票\"をご印刷の上、現品と一緒に以下の住所にご発送下さい。"]
[" 　*ご発送日のご連絡をお願い致します。"]
[]
["郵便番号","住所","TEL"]
["206-0041","東京都多摩市愛宕4-25-2 京西テクノス株式会社　東京校正センター","042-204-0020"]
[]
[]
["●校正票の記入・印刷方法"]
[]
["1.シート名「②リスト」の「緑色」の部分の記載をお願い致します。"]
["　*19行目の説明と、20行目の記入例をご参考下さい"]
[]
["2.「オレンジ」色の部分は、必要に応じてご入力・ご変更をお願い致します。"]
["  *「黄色」が表示された場合は、入力に誤りがありますのでご修正下さい"]
[]
["3.シート名「③依頼伝票」の　　　　　　　　　ボタンで\"校正票\"をご印刷お願い致します。"]
["　*個別に出力されたい場合は、「リスト」のA列のNo.を 　　　　　　　　　　　　　　　　へご入力の上、"]
["　　　　　　　　　ボタンで印刷して下さい。"]
[]
[]
["何かご不明な点等ございましたら、ご遠慮なくお問い合わせください。"]
["お手数をお掛けして申し訳ございませんが、宜しくお願い致します。"]

{"sheet":"②リスト(1つの機器につき1行ご記入下さい)","index":1,"n_rows":120,"n_cols":30,"rows_kept":120,"cut":false,"hidden":false,"merged":[[11,1,11,2],[11,3,11,6],[8,1,8,6],[9,1,9,2],[9,3,9,6],[10,1,10,2],[10,3,10,6],[12,1,12,2],[12,3,12,6],[13,1,13,2],[13,3,13,6],[14,1,14,2],[14,3,14,6],[15,1,15,2],[15,3,15,6],[16,1,16,2],[16,3,16,6],[17,1,17,2],[17,3,17,6]]}
[null,"●「緑色」の部分の記載をお願い致します。「オレンジ」色の部分は、必要に応じてご入力・ご変更をお願い致します。"]
[null,"●「黄色」が表示された場合は、入力に誤りがありますので、修正をお願い致します。"]
[]
[null,null,null,null,null,null,null,null,"■校正　　□修理+校正　　□修理のみ","■無　　□有",null,"■標準仕様　　□特別仕様　　□ＴＳ１６９４９","■指定無　　□電波法　　□ＪＣＳＳ　　□検定","■和文　　□英文","□不要　　■必要",null,null,null,"■無　　□有",null,"■上記お客様名と同じ　□その他",null,"■不要　□必要　【　□上記部門名と同じ　□その他",null,"■不要　　□必要　【□６ヶ月　□１年　□２年　□その他",null,"■宅配便　□集配便　□その他"]
[null,null,null,null,null,null,null,null,"□校正　　■修理+校正　　□修理のみ","□無　　■有",null,"□標準仕様　　■特別仕様　　□ＴＳ１６９４９","□指定無　　■電波法　　□ＪＣＳＳ　　□検定","□和文　　■英文","■不要　　□必要",null,null,null,"□無　　■有",null,"□上記お客様名と同じ　■その他",null,"□不要　■必要　【　■上記部門名と同じ　□その他",null,"□不要　　■必要　【■６ヶ月　□１年　□２年　□その他",null,"□宅配便　■集配便　□その他"]
[null,null,null,null,null,null,null,null,"□校正　　□修理+校正　　■修理のみ",null,null,"□標準仕様　　□特別仕様　　■ＴＳ１６９４９","□指定無　　□電波法　　■ＪＣＳＳ　　□検定","■和文　　■英文",null,null,null,null,null,null,null,null,"□不要　■必要　【　□上記部門名と同じ　■その他",null,"□不要　　■必要　【□６ヶ月　■１年　□２年　□その他",null,"□宅配便　□集配便　■その他"]
[null,null,null,null,null,null,null,null,null,null,null,null,"□指定無　　□電波法　　□ＪＣＳＳ　　■検定",null,null,null,null,null,null,null,null,null,null,null,"□不要　　■必要　【□６ヶ月　□１年　■２年　□その他"]
[null,null,null,null,null,null,null,null,null,null,null,null,null,null,null,null,null,null,null,null,null,null,null,null,"□不要　　■必要　【□６ヶ月　□１年　□２年　■その他"]
[null,"お客様情報ご記入欄 （弊社へ依頼される方と、所有される方が異なる場合は、弊社へ依頼されるお客様の情報をご記入下さい）"]
[null,"⑨ お客様名"]
[null,"⑪ 部門/部署"]
[null,"⑩ 御担当者",null,null,null,null,null,"様"]
[null,"(Ⅳ) Ｅメール"]
[null,"⑭御住所"]
[null,"⑫ＴＥＬ"]
[null,"⑬ＦＡＸ"]
[null,"(Ⅱ) 費用請求先"]
[null,"(Ⅲ) 費用請求先部門",null,null,null,null,null,7,8,9,10,11,12,13,14,15,16,17,18,19,20,21,22,23,24,25,26,27,28,29]
["No.","①校正\n予定月\n（半角数字）","②管理番号登録番号\n不明な場合には製造番号をご記入下さい","③ 御依頼内容\n校正のみの場合は変更不要","④ 品名","⑤ メーカ名","⑥ 型名/型式","⑦製造番号（S/N)","⑧\n数量\n1つの機器につき1行の為、\n自動で\"1\"と入力されます","(Ⅰ)添付品\n付属品がなければ変更不要","添付品\n付属内容\n（添付品がある時のみ）","⑮ 校正仕様\n一般校正であれば変更不要","⑯ 準拠規格等\n一般校正であれば変更不要","⑰ 書類言語\n日本語であれば変更の必要不要","⑱ 校正試験\n成績書添付(無料）\n変更不要","⑲ 校正証明書添付\n（有料）\n不要の場合はご変更下さい","⑳ ﾄﾚｰｻﾋﾞﾘﾃｨ体系図　個別添付\n（有料）\n通常は「個別」で発行します","21 ﾄﾚｰｻﾋﾞﾘﾃｨ体系図　全体図添付\n（有料）\n「全体図」が必要の場合、\n「個別」は不要にご変更下さい","(Ⅴ) オーダー\n番号\n（有無）","オーダー番号(詳細）\n←を「有」にした場合は、\nご記入下さい","(Ⅵ) 成績書記載社名\nエンドユーザー様がいる場合は\n「その他」をご選択ください","成績書記載社名\n←を「その他」と選択した場合は、\nエンドユーザー様名をご記入下さい","(Ⅶ) 成績書記載　部門名\nエンドユーザー様より「部署名も入れてほしい」\nと要望がない限り変更不要","成績書記載部門名\nその他記載","22 校正済ラベル（無料）\nエンドユーザー様の校正期間が1年以外であれば\nご変更下さい","校正済ラベル\nその他の場合","(Ⅷ) 返却方法","返却方法\nその他の場合","(Ⅸ) 御希望納期\n(例　2015/12/25）\n特段指定がなければ記載不要","(Ⅹ) 不具合内容\n特別返却先\n備考"]
["例",8,"*****","■校正　　□修理+校正　　□修理のみ","デジタルオシロスコープ","レクロイ","***","***","1","■無　　□有",null,"■標準仕様　　□特別仕様　　□ＴＳ１６９４９","■指定無　　□電波法　　□ＪＣＳＳ　　□検定","■和文　　□英文","□不要　　■必要","□不要　　■必要","□不要　　■必要","■不要　　□必要","■無　　□有",null,"■上記お客様名と同じ　□その他",null,"■不要　□必要　【　□上記部門名と同じ　□その他",null,"□不要　　■必要　【□６ヶ月　■１年　□２年　□その他",null,"■宅配便　□集配便　□その他"]
[1,null,null,"■校正　　□修理+校正　　□修理のみ",null,null,null,null,{"$f":"IF(B21<>\"\",1,\"\")","v":""},"■無　　□有",null,"■標準仕様　　□特別仕様　　□ＴＳ１６９４９","■指定無　　□電波法　　□ＪＣＳＳ　　□検定","■和文　　□英文","□不要　　■必要","□不要　　■必要","□不要　　■必要","■不要　　□必要","■無　　□有",null,"■上記お客様名と同じ　□その他",null,"■不要　□必要　【　□上記部門名と同じ　□その他",null,"□不要　　■必要　【□６ヶ月　■１年　□２年　□その他",null,"■宅配便　□集配便　□その他"]
[2,null,null,"■校正　　□修理+校正　　□修理のみ",null,null,null,null,"","■無　　□有",null,"■標準仕様　　□特別仕様　　□ＴＳ１６９４９","■指定無　　□電波法　　□ＪＣＳＳ　　□検定","■和文　　□英文","□不要　　■必要","□不要　　■必要","□不要　　■必要","■不要　　□必要","■無　　□有",null,"■上記お客様名と同じ　□その他",null,"■不要　□必要　【　□上記部門名と同じ　□その他",null,"□不要　　■必要　【□６ヶ月　■１年　□２年　□その他",null,"■宅配便　□集配便　□その他"]
[3,null,null,"■校正　　□修理+校正　　□修理のみ",null,null,null,null,"","■無　　□有",null,"■標準仕様　　□特別仕様　　□ＴＳ１６９５０","■指定無　　□電波法　　□ＪＣＳＳ　　□検定","■和文　　□英文","□不要　　■必要","□不要　　■必要","□不要　　■必要","■不要　　□必要","■無　　□有",null,"■上記お客様名と同じ　□その他",null,"■不要　□必要　【　□上記部門名と同じ　□その他",null,"□不要　　■必要　【□６ヶ月　■１年　□２年　□その他",null,"■宅配便　□集配便　□その他"]
[4,null,null,"■校正　　□修理+校正　　□修理のみ",null,null,null,null,"","■無　　□有",null,"■標準仕様　　□特別仕様　　□ＴＳ１６９４９","■指定無　　□電波法　　□ＪＣＳＳ　　□検定","■和文　　□英文","□不要　　■必要","□不要　　■必要","□不要　　■必要","■不要　　□必要","■無　　□有",null,"■上記お客様名と同じ　□その他",null,"■不要　□必要　【　□上記部門名と同じ　□その他",null,"□不要　　■必要　【□６ヶ月　■１年　□２年　□その他",null,"■宅配便　□集配便　□その他"]
[5,null,null,"■校正　　□修理+校正　　□修理のみ",null,null,null,null,"","■無　　□有",null,"■標準仕様　　□特別仕様　　□ＴＳ１６９４９","■指定無　　□電波法　　□ＪＣＳＳ　　□検定","■和文　　□英文","□不要　　■必要","□不要　　■必要","□不要　　■必要","■不要　　□必要","■無　　□有",null,"■上記お客様名と同じ　□その他",null,"■不要　□必要　【　□上記部門名と同じ　□その他",null,"□不要　　■必要　【□６ヶ月　■１年　□２年　□その他",null,"■宅配便　□集配便　□その他"]
[6,null,null,"■校正　　□修理+校正　　□修理のみ",null,null,null,null,"","■無　　□有",null,"■標準仕様　　□特別仕様　　□ＴＳ１６９４９","■指定無　　□電波法　　□ＪＣＳＳ　　□検定","■和文　　□英文","□不要　　■必要","□不要　　■必要","□不要　　■必要","■不要　　□必要","■無　　□有",null,"■上記お客様名と同じ　□その他",null,"■不要　□必要　【　□上記部門名と同じ　□その他",null,"□不要　　■必要　【□６ヶ月　■１年　□２年　□その他",null,"■宅配便　□集配便　□その他"]
[7,null,null,"■校正　　□修理+校正　　□修理のみ",null,null,null,null,"","■無　　□有",null,"■標準仕様　　□特別仕様　　□ＴＳ１６９４９","■指定無　　□電波法　　□ＪＣＳＳ　　□検定","■和文　　□英文","□不要　　■必要","□不要　　■必要","□不要　　■必要","■不要　　□必要","■無　　□有",null,"■上記お客様名と同じ　□その他",null,"■不要　□必要　【　□上記部門名と同じ　□その他",null,"□不要　　■必要　【□６ヶ月　■１年　□２年　□その他",null,"■宅配便　□集配便　□その他"]
[8,null,null,"■校正　　□修理+校正　　□修理のみ",null,null,null,null,"","■無　　□有",null,"■標準仕様　　□特別仕様　　□ＴＳ１６９４９","■指定無　　□電波法　　□ＪＣＳＳ　　□検定","■和文　　□英文","□不要　　■必要","□不要　　■必要","□不要　　■必要","■不要　　□必要","■無　　□有",null,"■上記お客様名と同じ　□その他",null,"■不要　□必要　【　□上記部門名と同じ　□その他",null,"□不要　　■必要　【□６ヶ月　■１年　□２年　□その他",null,"■宅配便　□集配便　□その他"]
[9,null,null,"■校正　　□修理+校正　　□修理のみ",null,null,null,null,{"$f":"IF(B29<>\"\",1,\"\")","v":""},"■無　　□有",null,"■標準仕様　　□特別仕様　　□ＴＳ１６９４９","■指定無　　□電波法　　□ＪＣＳＳ　　□検定","■和文　　□英文","□不要　　■必要","□不要　　■必要","□不要　　■必要","■不要　　□必要","■無　　□有",null,"■上記お客様名と同じ　□その他",null,"■不要　□必要　【　□上記部門名と同じ　□その他",null,"□不要　　■必要　【□６ヶ月　■１年　□２年　□その他",null,"■宅配便　□集配便　□その他"]
[10,null,null,"■校正　　□修理+校正　　□修理のみ",null,null,null,null,"","■無　　□有",null,"■標準仕様　　□特別仕様　　□ＴＳ１６９４９","■指定無　　□電波法　　□ＪＣＳＳ　　□検定","■和文　　□英文","□不要　　■必要","□不要　　■必要","□不要　　■必要","■不要　　□必要","■無　　□有",null,"■上記お客様名と同じ　□その他",null,"■不要　□必要　【　□上記部門名と同じ　□その他",null,"□不要　　■必要　【□６ヶ月　■１年　□２年　□その他",null,"■宅配便　□集配便　□その他"]
[11,null,null,"■校正　　□修理+校正　　□修理のみ",null,null,null,null,"","■無　　□有",null,"■標準仕様　　□特別仕様　　□ＴＳ１６９４９","■指定無　　□電波法　　□ＪＣＳＳ　　□検定","■和文　　□英文","□不要　　■必要","□不要　　■必要","□不要　　■必要","■不要　　□必要","■無　　□有",null,"■上記お客様名と同じ　□その他",null,"■不要　□必要　【　□上記部門名と同じ　□その他",null,"□不要　　■必要　【□６ヶ月　■１年　□２年　□その他",null,"■宅配便　□集配便　□その他"]
[12,null,null,"■校正　　□修理+校正　　□修理のみ",null,null,null,null,"","■無　　□有",null,"■標準仕様　　□特別仕様　　□ＴＳ１６９４９","■指定無　　□電波法　　□ＪＣＳＳ　　□検定","■和文　　□英文","□不要　　■必要","□不要　　■必要","□不要　　■必要","■不要　　□必要","■無　　□有",null,"■上記お客様名と同じ　□その他",null,"■不要　□必要　【　□上記部門名と同じ　□その他",null,"□不要　　■必要　【□６ヶ月　■１年　□２年　□その他",null,"■宅配便　□集配便　□その他"]
[13,null,null,"■校正　　□修理+校正　　□修理のみ",null,null,null,null,"","■無　　□有",null,"■標準仕様　　□特別仕様　　□ＴＳ１６９４９","■指定無　　□電波法　　□ＪＣＳＳ　　□検定","■和文　　□英文","□不要　　■必要","□不要　　■必要","□不要　　■必要","■不要　　□必要","■無　　□有",null,"■上記お客様名と同じ　□その他",null,"■不要　□必要　【　□上記部門名と同じ　□その他",null,"□不要　　■必要　【□６ヶ月　■１年　□２年　□その他",null,"■宅配便　□集配便　□その他"]
[14,null,null,"■校正　　□修理+校正　　□修理のみ",null,null,null,null,"","■無　　□有",null,"■標準仕様　　□特別仕様　　□ＴＳ１６９４９","■指定無　　□電波法　　□ＪＣＳＳ　　□検定","■和文　　□英文","□不要　　■必要","□不要　　■必要","□不要　　■必要","■不要　　□必要","■無　　□有",null,"■上記お客様名と同じ　□その他",null,"■不要　□必要　【　□上記部門名と同じ　□その他",null,"□不要　　■必要　【□６ヶ月　■１年　□２年　□その他",null,"■宅配便　□集配便　□その他"]
[15,null,null,"■校正　　□修理+校正　　□修理のみ",null,null,null,null,"","■無　　□有",null,"■標準仕様　　□特別仕様　　□ＴＳ１６９４９","■指定無　　□電波法　　□ＪＣＳＳ　　□検定","■和文　　□英文","□不要　　■必要","□不要　　■必要","□不要　　■必要","■不要　　□必要","■無　　□有",null,"■上記お客様名と同じ　□その他",null,"■不要　□必要　【　□上記部門名と同じ　□その他",null,"□不要　　■必要　【□６ヶ月　■１年　□２年　□その他",null,"■宅配便　□集配便　□その他"]
[16,null,null,"■校正　　□修理+校正　　□修理のみ",null,null,null,null,"","■無　　□有",null,"■標準仕様　　□特別仕様　　□ＴＳ１６９４９","■指定無　　□電波法　　□ＪＣＳＳ　　□検定","■和文　　□英文","□不要　　■必要","□不要　　■必要","□不要　　■必要","■不要　　□必要","■無　　□有",null,"■上記お客様名と同じ　□その他",null,"■不要　□必要　【　□上記部門名と同じ　□その他",null,"□不要　　■必要　【□６ヶ月　■１年　□２年　□その他",null,"■宅配便　□集配便　□その他"]
[17,null,null,"■校正　　□修理+校正　　□修理のみ",null,null,null,null,"","■無　　□有",null,"■標準仕様　　□特別仕様　　□ＴＳ１６９４９","■指定無　　□電波法　　□ＪＣＳＳ　　□検定","■和文　　□英文","□不要　　■必要","□不要　　■必要","□不要　　■必要","■不要　　□必要","■無　　□有",null,"■上記お客様名と同じ　□その他",null,"■不要　□必要　【　□上記部門名と同じ　□その他",null,"□不要　　■必要　【□６ヶ月　■１年　□２年　□その他",null,"■宅配便　□集配便　□その他"]
[18,null,null,"■校正　　□修理+校正　　□修理のみ",null,null,null,null,"","■無　　□有",null,"■標準仕様　　□特別仕様　　□ＴＳ１６９４９","■指定無　　□電波法　　□ＪＣＳＳ　　□検定","■和文　　□英文","□不要　　■必要","□不要　　■必要","□不要　　■必要","■不要　　□必要","■無　　□有",null,"■上記お客様名と同じ　□その他",null,"■不要　□必要　【　□上記部門名と同じ　□その他",null,"□不要　　■必要　【□６ヶ月　■１年　□２年　□その他",null,"■宅配便　□集配便　□その他"]
[19,null,null,"■校正　　□修理+校正　　□修理のみ",null,null,null,null,"","■無　　□有",null,"■標準仕様　　□特別仕様　　□ＴＳ１６９４９","■指定無　　□電波法　　□ＪＣＳＳ　　□検定","■和文　　□英文","□不要　　■必要","□不要　　■必要","□不要　　■必要","■不要　　□必要","■無　　□有",null,"■上記お客様名と同じ　□その他",null,"■不要　□必要　【　□上記部門名と同じ　□その他",null,"□不要　　■必要　【□６ヶ月　■１年　□２年　□その他",null,"■宅配便　□集配便　□その他"]
[20,null,null,"■校正　　□修理+校正　　□修理のみ",null,null,null,null,"","■無　　□有",null,"■標準仕様　　□特別仕様　　□ＴＳ１６９４９","■指定無　　□電波法　　□ＪＣＳＳ　　□検定","■和文　　□英文","□不要　　■必要","□不要　　■必要","□不要　　■必要","■不要　　□必要","■無　　□有",null,"■上記お客様名と同じ　□その他",null,"■不要　□必要　【　□上記部門名と同じ　□その他",null,"□不要　　■必要　【□６ヶ月　■１年　□２年　□その他",null,"■宅配便　□集配便　□その他"]
[21,null,null,"■校正　　□修理+校正　　□修理のみ",null,null,null,null,"","■無　　□有",null,"■標準仕様　　□特別仕様　　□ＴＳ１６９４９","■指定無　　□電波法　　□ＪＣＳＳ　　□検定","■和文　　□英文","□不要　　■必要","□不要　　■必要","□不要　　■必要","■不要　　□必要","■無　　□有",null,"■上記お客様名と同じ　□その他",null,"■不要　□必要　【　□上記部門名と同じ　□その他",null,"□不要　　■必要　【□６ヶ月　■１年　□２年　□その他",null,"■宅配便　□集配便　□その他"]
[22,null,null,"■校正　　□修理+校正　　□修理のみ",null,null,null,null,"","■無　　□有",null,"■標準仕様　　□特別仕様　　□ＴＳ１６９４９","■指定無　　□電波法　　□ＪＣＳＳ　　□検定","■和文　　□英文","□不要　　■必要","□不要　　■必要","□不要　　■必要","■不要　　□必要","■無　　□有",null,"■上記お客様名と同じ　□その他",null,"■不要　□必要　【　□上記部門名と同じ　□その他",null,"□不要　　■必要　【□６ヶ月　■１年　□２年　□その他",null,"■宅配便　□集配便　□その他"]
[23,null,null,"■校正　　□修理+校正　　□修理のみ",null,null,null,null,"","■無　　□有",null,"■標準仕様　　□特別仕様　　□ＴＳ１６９４９","■指定無　　□電波法　　□ＪＣＳＳ　　□検定","■和文　　□英文","□不要　　■必要","□不要　　■必要","□不要　　■必要","■不要　　□必要","■無　　□有",null,"■上記お客様名と同じ　□その他",null,"■不要　□必要　【　□上記部門名と同じ　□その他",null,"□不要　　■必要　【□６ヶ月　■１年　□２年　□その他",null,"■宅配便　□集配便　□その他"]
[24,null,null,"■校正　　□修理+校正　　□修理のみ",null,null,null,null,"","■無　　□有",null,"■標準仕様　　□特別仕様　　□ＴＳ１６９４９","■指定無　　□電波法　　□ＪＣＳＳ　　□検定","■和文　　□英文","□不要　　■必要","□不要　　■必要","□不要　　■必要","■不要　　□必要","■無　　□有",null,"■上記お客様名と同じ　□その他",null,"■不要　□必要　【　□上記部門名と同じ　□その他",null,"□不要　　■必要　【□６ヶ月　■１年　□２年　□その他",null,"■宅配便　□集配便　□その他"]
[25,null,null,"■校正　　□修理+校正　　□修理のみ",null,null,null,null,"","■無　　□有",null,"■標準仕様　　□特別仕様　　□ＴＳ１６９４９","■指定無　　□電波法　　□ＪＣＳＳ　　□検定","■和文　　□英文","□不要　　■必要","□不要　　■必要","□不要　　■必要","■不要　　□必要","■無　　□有",null,"■上記お客様名と同じ　□その他",null,"■不要　□必要　【　□上記部門名と同じ　□その他",null,"□不要　　■必要　【□６ヶ月　■１年　□２年　□その他",null,"■宅配便　□集配便　□その他"]
[26,null,null,"■校正　　□修理+校正　　□修理のみ",null,null,null,null,"","■無　　□有",null,"■標準仕様　　□特別仕様　　□ＴＳ１６９４９","■指定無　　□電波法　　□ＪＣＳＳ　　□検定","■和文　　□英文","□不要　　■必要","□不要　　■必要","□不要　　■必要","■不要　　□必要","■無　　□有",null,"■上記お客様名と同じ　□その他",null,"■不要　□必要　【　□上記部門名と同じ　□その他",null,"□不要　　■必要　【□６ヶ月　■１年　□２年　□その他",null,"■宅配便　□集配便　□その他"]
[27,null,null,"■校正　　□修理+校正　　□修理のみ",null,null,null,null,"","■無　　□有",null,"■標準仕様　　□特別仕様　　□ＴＳ１６９４９","■指定無　　□電波法　　□ＪＣＳＳ　　□検定","■和文　　□英文","□不要　　■必要","□不要　　■必要","□不要　　■必要","■不要　　□必要","■無　　□有",null,"■上記お客様名と同じ　□その他",null,"■不要　□必要　【　□上記部門名と同じ　□その他",null,"□不要　　■必要　【□６ヶ月　■１年　□２年　□その他",null,"■宅配便　□集配便　□その他"]
[28,null,null,"■校正　　□修理+校正　　□修理のみ",null,null,null,null,"","■無　　□有",null,"■標準仕様　　□特別仕様　　□ＴＳ１６９４９","■指定無　　□電波法　　□ＪＣＳＳ　　□検定","■和文　　□英文","□不要　　■必要","□不要　　■必要","□不要　　■必要","■不要　　□必要","■無　　□有",null,"■上記お客様名と同じ　□その他",null,"■不要　□必要　【　□上記部門名と同じ　□その他",null,"□不要　　■必要　【□６ヶ月　■１年　□２年　□その他",null,"■宅配便　□集配便　□その他"]
[29,null,null,"■校正　　□修理+校正　　□修理のみ",null,null,null,null,"","■無　　□有",null,"■標準仕様　　□特別仕様　　□ＴＳ１６９４９","■指定無　　□電波法　　□ＪＣＳＳ　　□検定","■和文　　□英文","□不要　　■必要","□不要　　■必要","□不要　　■必要","■不要　　□必要","■無　　□有",null,"■上記お客様名と同じ　□その他",null,"■不要　□必要　【　□上記部門名と同じ　□その他",null,"□不要　　■必要　【□６ヶ月　■１年　□２年　□その他",null,"■宅配便　□集配便　□その他"]
[30,null,null,"■校正　　□修理+校正　　□修理のみ",null,null,null,null,"","■無　　□有",null,"■標準仕様　　□特別仕様　　□ＴＳ１６９４９","■指定無　　□電波法　　□ＪＣＳＳ　　□検定","■和文　　□英文","□不要　　■必要","□不要　　■必要","□不要　　■必要","■不要　　□必要","■無　　□有",null,"■上記お客様名と同じ　□その他",null,"■不要　□必要　【　□上記部門名と同じ　□その他",null,"□不要　　■必要　【□６ヶ月　■１年　□２年　□その他",null,"■宅配便　□集配便　□その他"]
[31,null,null,"■校正　　□修理+校正　　□修理のみ",null,null,null,null,"","■無　　□有",null,"■標準仕様　　□特別仕様　　□ＴＳ１６９４９","■指定無　　□電波法　　□ＪＣＳＳ　　□検定","■和文　　□英文","□不要　　■必要","□不要　　■必要","□不要　　■必要","■不要　　□必要","■無　　□有",null,"■上記お客様名と同じ　□その他",null,"■不要　□必要　【　□上記部門名と同じ　□その他",null,"□不要　　■必要　【□６ヶ月　■１年　□２年　□その他",null,"■宅配便　□集配便　□その他"]
[32,null,null,"■校正　　□修理+校正　　□修理のみ",null,null,null,null,"","■無　　□有",null,"■標準仕様　　□特別仕様　　□ＴＳ１６９４９","■指定無　　□電波法　　□ＪＣＳＳ　　□検定","■和文　　□英文","□不要　　■必要","□不要　　■必要","□不要　　■必要","■不要　　□必要","■無　　□有",null,"■上記お客様名と同じ　□その他",null,"■不要　□必要　【　□上記部門名と同じ　□その他",null,"□不要　　■必要　【□６ヶ月　■１年　□２年　□その他",null,"■宅配便　□集配便　□その他"]
[33,null,null,"■校正　　□修理+校正　　□修理のみ",null,null,null,null,"","■無　　□有",null,"■標準仕様　　□特別仕様　　□ＴＳ１６９４９","■指定無　　□電波法　　□ＪＣＳＳ　　□検定","■和文　　□英文","□不要　　■必要","□不要　　■必要","□不要　　■必要","■不要　　□必要","■無　　□有",null,"■上記お客様名と同じ　□その他",null,"■不要　□必要　【　□上記部門名と同じ　□その他",null,"□不要　　■必要　【□６ヶ月　■１年　□２年　□その他",null,"■宅配便　□集配便　□その他"]
[34,null,null,"■校正　　□修理+校正　　□修理のみ",null,null,null,null,"","■無　　□有",null,"■標準仕様　　□特別仕様　　□ＴＳ１６９４９","■指定無　　□電波法　　□ＪＣＳＳ　　□検定","■和文　　□英文","□不要　　■必要","□不要　　■必要","□不要　　■必要","■不要　　□必要","■無　　□有",null,"■上記お客様名と同じ　□その他",null,"■不要　□必要　【　□上記部門名と同じ　□その他",null,"□不要　　■必要　【□６ヶ月　■１年　□２年　□その他",null,"■宅配便　□集配便　□その他"]
[35,null,null,"■校正　　□修理+校正　　□修理のみ",null,null,null,null,"","■無　　□有",null,"■標準仕様　　□特別仕様　　□ＴＳ１６９４９","■指定無　　□電波法　　□ＪＣＳＳ　　□検定","■和文　　□英文","□不要　　■必要","□不要　　■必要","□不要　　■必要","■不要　　□必要","■無　　□有",null,"■上記お客様名と同じ　□その他",null,"■不要　□必要　【　□上記部門名と同じ　□その他",null,"□不要　　■必要　【□６ヶ月　■１年　□２年　□その他",null,"■宅配便　□集配便　□その他"]
[36,null,null,"■校正　　□修理+校正　　□修理のみ",null,null,null,null,"","■無　　□有",null,"■標準仕様　　□特別仕様　　□ＴＳ１６９４９","■指定無　　□電波法　　□ＪＣＳＳ　　□検定","■和文　　□英文","□不要　　■必要","□不要　　■必要","□不要　　■必要","■不要　　□必要","■無　　□有",null,"■上記お客様名と同じ　□その他",null,"■不要　□必要　【　□上記部門名と同じ　□その他",null,"□不要　　■必要　【□６ヶ月　■１年　□２年　□その他",null,"■宅配便　□集配便　□その他"]
[37,null,null,"■校正　　□修理+校正　　□修理のみ",null,null,null,null,"","■無　　□有",null,"■標準仕様　　□特別仕様　　□ＴＳ１６９４９","■指定無　　□電波法　　□ＪＣＳＳ　　□検定","■和文　　□英文","□不要　　■必要","□不要　　■必要","□不要　　■必要","■不要　　□必要","■無　　□有",null,"■上記お客様名と同じ　□その他",null,"■不要　□必要　【　□上記部門名と同じ　□その他",null,"□不要　　■必要　【□６ヶ月　■１年　□２年　□その他",null,"■宅配便　□集配便　□その他"]
[38,null,null,"■校正　　□修理+校正　　□修理のみ",null,null,null,null,"","■無　　□有",null,"■標準仕様　　□特別仕様　　□ＴＳ１６９４９","■指定無　　□電波法　　□ＪＣＳＳ　　□検定","■和文　　□英文","□不要　　■必要","□不要　　■必要","□不要　　■必要","■不要　　□必要","■無　　□有",null,"■上記お客様名と同じ　□その他",null,"■不要　□必要　【　□上記部門名と同じ　□その他",null,"□不要　　■必要　【□６ヶ月　■１年　□２年　□その他",null,"■宅配便　□集配便　□その他"]
[39,null,null,"■校正　　□修理+校正　　□修理のみ",null,null,null,null,"","■無　　□有",null,"■標準仕様　　□特別仕様　　□ＴＳ１６９４９","■指定無　　□電波法　　□ＪＣＳＳ　　□検定","■和文　　□英文","□不要　　■必要","□不要　　■必要","□不要　　■必要","■不要　　□必要","■無　　□有",null,"■上記お客様名と同じ　□その他",null,"■不要　□必要　【　□上記部門名と同じ　□その他",null,"□不要　　■必要　【□６ヶ月　■１年　□２年　□その他",null,"■宅配便　□集配便　□その他"]
[40,null,null,"■校正　　□修理+校正　　□修理のみ",null,null,null,null,"","■無　　□有",null,"■標準仕様　　□特別仕様　　□ＴＳ１６９４９","■指定無　　□電波法　　□ＪＣＳＳ　　□検定","■和文　　□英文","□不要　　■必要","□不要　　■必要","□不要　　■必要","■不要　　□必要","■無　　□有",null,"■上記お客様名と同じ　□その他",null,"■不要　□必要　【　□上記部門名と同じ　□その他",null,"□不要　　■必要　【□６ヶ月　■１年　□２年　□その他",null,"■宅配便　□集配便　□その他"]
{"$rows_left_out":61}
{"sheet":"③依頼伝票(印刷の上、現品と一緒にご送付下さい）","index":2,"n_rows":88,"n_cols":7,"rows_kept":88,"cut":false,"hidden":false,"merged":[[53,5,53,6],[55,1,55,2],[55,3,55,4],[55,5,55,6],[50,3,50,6],[8,3,8,6],[8,1,8,2],[31,5,31,6],[73,1,73,2],[73,3,73,4],[13,1,13,2],[31,3,31,4],[33,1,33,2],[33,3,33,4],[11,5,11,6],[13,5,13,6],[24,1,24,4],[22,1,22,4],[20,1,20,4],[13,3,13,4],[29,1,29,3],[18,1,18,4],[15,2,15,6],[11,1,11,4],[41,5,41,6],[43,1,44,6],[18,5,18,6],[20,5,20,6],[22,5,22,6],[24,5,24,6],[29,4,29,6],[31,1,31,2],[26,1,26,5],[60,5,60,6],[62,1,62,4],[60,1,60,4],[62,5,62,6],[64,1,64,4],[64,5,64,6],[66,1,66,4],[66,5,66,6],[85,1,86,6],[73,5,73,6],[83,5,83,6],[75,1,75,2],[75,3,75,4],[71,1,71,3],[71,4,71,6],[68,1,68,5]]}
[]
[]
[null,"伝票カウンタ",1]
[]
[]
[]
[{"$f":"\"計測器／計量器校正・修理票 Ａ　【　\"&IF(ISBLANK(INDEX('②リスト(1つの機器につき1行ご記入下さい)'!B21:AD120,$C$3,1)),\"\",INDEX('②リスト(1つの機器につき1行ご記入下さい)'!B21:AD120,$C$3,1))&\"　月】\"","v":"計測器／計量器校正・修理票 Ａ　【　　月】"},null,null,null,null,"作成年月日：",{"$f":"TODAY()+K18","v":"2022-12-13"}]
["管理番号／登録番号",null,null,"御依頼内容"]
[null,{"$f":"IF(ISBLANK(INDEX('②リスト(1つの機器につき1行ご記入下さい)'!B21:AD120,$C$3,2)),\"\",INDEX('②リスト(1つの機器につき1行ご記入下さい)'!B21:AD120,$C$3,2))","v":""},null,{"$f":"IF(ISBLANK(INDEX('②リスト(1つの機器につき1行ご記入下さい)'!B21:AD120,$C$3,3)),\"\",INDEX('②リスト(1つの機器につき1行ご記入下さい)'!B21:AD120,$C$3,3))","v":"■校正　　□修理+校正　　□修理のみ"}]
[]
["品名",null,null,null,null,"メーカー名"]
[null,{"$f":"IF(ISBLANK(INDEX('②リスト(1つの機器につき1行ご記入下さい)'!B21:AD120,$C$3,4)),\"\",INDEX('②リスト(1つの機器につき1行ご記入下さい)'!B21:AD120,$C$3,4))","v":""},null,null,null,{"$f":"IF(ISBLANK(INDEX('②リスト(1つの機器につき1行ご記入下さい)'!B21:AD120,$C$3,5)),\"\",INDEX('②リスト(1つの機器につき1行ご記入下さい)'!B21:AD120,$C$3,5))","v":""}]
["型名／型式",null,null,"製造番号",null,"数量"]
[null,{"$f":"IF(ISBLANK(INDEX('②リスト(1つの機器につき1行ご記入下さい)'!B21:AD120,$C$3,6)),\"\",INDEX('②リスト(1つの機器につき1行ご記入下さい)'!B21:AD120,$C$3,6))","v":""},null,{"$f":"IF(ISBLANK(INDEX('②リスト(1つの機器につき1行ご記入下さい)'!B21:AD120,$C$3,7)),\"\",INDEX('②リスト(1つの機器につき1行ご記入下さい)'!B21:AD120,$C$3,7))","v":""},null,{"$f":"IF(ISBLANK(INDEX('②リスト(1つの機器につき1行ご記入下さい)'!B21:AD120,$C$3,8)),\"\",INDEX('②リスト(1つの機器につき1行ご記入下さい)'!B21:AD120,$C$3,8))","v":""}]
["添付品"]
[null,{"$f":"IF(ISBLANK(INDEX('②リスト(1つの機器につき1行ご記入下さい)'!B21:AD120,$C$3,9)),\"\",(INDEX('②リスト(1つの機器につき1行ご記入下さい)'!B21:AD120,$C$3,9)&\"　(\"))","v":"■無　　□有　("},{"$f":"IF(ISBLANK(INDEX('②リスト(1つの機器につき1行ご記入下さい)'!B21:AD120,$C$3,10)),\")\",(INDEX('②リスト(1つの機器につき1行ご記入下さい)'!B21:AD120,$C$3,10)&\"　　)\"))","v":")"}]
[]
["お客様名",null,null,null,null,"御担当者"]
[null,{"$f":"IF(ISBLANK('②リスト(1つの機器につき1行ご記入下さい)'!D10),\"\",'②リスト(1つの機器につき1行ご記入下さい)'!D10)","v":""},null,null,null,{"$f":"IF(ISBLANK('②リスト(1つの機器につき1行ご記入下さい)'!D12),\"\",'②リスト(1つの機器につき1行ご記入下さい)'!D12&\"　様\")","v":""}]
["部門名",null,null,null,null,"ＴＥＬ"]
[null,{"$f":"IF(ISBLANK('②リスト(1つの機器につき1行ご記入下さい)'!D11),\"\",'②リスト(1つの機器につき1行ご記入下さい)'!D11)","v":""},null,null,null,{"$f":"IF(ISBLANK('②リスト(1つの機器につき1行ご記入下さい)'!D15),\"\",'②リスト(1つの機器につき1行ご記入下さい)'!D15)","v":""}]
["費用請求先",null,null,null,null,"ＦＡＸ"]
[null,{"$f":"IF(ISBLANK('②リスト(1つの機器につき1行ご記入下さい)'!D17),\"\",'②リスト(1つの機器につき1行ご記入下さい)'!D17)","v":""},null,null,null,{"$f":"IF(ISBLANK('②リスト(1つの機器につき1行ご記入下さい)'!D16),\"\",'②リスト(1つの機器につき1行ご記入下さい)'!D16)","v":""}]
["費用請求先部門",null,null,null,null,"Ｅメール"]
[null,{"$f":"IF(ISBLANK('②リスト(1つの機器につき1行ご記入下さい)'!D18),\"\",'②リスト(1つの機器につき1行ご記入下さい)'!D18)","v":""},null,null,null,{"$f":"IF(ISBLANK('②リスト(1つの機器につき1行ご記入下さい)'!D13),\"\",'②リスト(1つの機器につき1行ご記入下さい)'!D13)","v":""}]
["住所",null,null,null,null,null,"校正区分"]
[null,{"$f":"IF(ISBLANK('②リスト(1つの機器につき1行ご記入下さい)'!D14),\"\",'②リスト(1つの機器につき1行ご記入下さい)'!D14)","v":""}]
[]
["校正仕様",null,null,null,"準拠規格等"]
[null,{"$f":"IF(ISBLANK(INDEX('②リスト(1つの機器につき1行ご記入下さい)'!B21:AD120,$C$3,11)),\"\",INDEX('②リスト(1つの機器につき1行ご記入下さい)'!B21:AD120,$C$3,11))","v":"■標準仕様　　□特別仕様　　□ＴＳ１６９４９"},null,null,{"$f":"IF(ISBLANK(INDEX('②リスト(1つの機器につき1行ご記入下さい)'!B21:AD120,$C$3,12)),\"\",INDEX('②リスト(1つの機器につき1行ご記入下さい)'!B21:AD120,$C$3,12))","v":"■指定無　　□電波法　　□ＪＣＳＳ　　□検定"}]
["書類言語",null,null,"校正試験成績書添付（無料）",null,"校正証明書（有料）"]
[null,{"$f":"IF(ISBLANK(INDEX('②リスト(1つの機器につき1行ご記入下さい)'!B21:AD120,$C$3,13)),\"\",INDEX('②リスト(1つの機器につき1行ご記入下さい)'!B21:AD120,$C$3,13))","v":"■和文　　□英文"},null,{"$f":"IF(ISBLANK(INDEX('②リスト(1つの機器につき1行ご記入下さい)'!B21:AD120,$C$3,14)),\"\",INDEX('②リスト(1つの機器につき1行ご記入下さい)'!B21:AD120,$C$3,14))","v":"□不要　　■必要"},null,{"$f":"IF(ISBLANK(INDEX('②リスト(1つの機器につき1行ご記入下さい)'!B21:AD120,$C$3,15)),\"\",INDEX('②リスト(1つの機器につき1行ご記入下さい)'!B21:AD120,$C$3,15))","v":"□不要　　■必要"}]
["トレーサビリティ体系図・個別（有料）",null,null,"トレーサビリティ体系図・全体（有料）",null,"オーダー番号"]
["　",{"$f":"IF(ISBLANK(INDEX('②リスト(1つの機器につき1行ご記入下さい)'!B21:AD120,$C$3,16)),\"\",INDEX('②リスト(1つの機器につき1行ご記入下さい)'!B21:AD120,$C$3,16))","v":"□不要　　■必要"},null,{"$f":"IF(ISBLANK(INDEX('②リスト(1つの機器につき1行ご記入下さい)'!B21:AD120,$C$3,17)),\"\",INDEX('②リスト(1つの機器につき1行ご記入下さい)'!B21:AD120,$C$3,17))","v":"■不要　　□必要"},null,{"$f":"IF(ISBLANK(INDEX('②リスト(1つの機器につき1行ご記入下さい)'!B21:AD120,$C$3,18)),\"\",(INDEX('②リスト(1つの機器につき1行ご記入下さい)'!B21:AD120,$C$3,18)&\"　(\"))","v":"■無　　□有　("},{"$f":"IF(ISBLANK(INDEX('②リスト(1つの機器につき1行ご記入下さい)'!B21:AD120,$C$3,19)),\"\",(INDEX('②リスト(1つの機器につき1行ご記入下さい)'!B21:AD120,$C$3,19)&\"　　)\"))","v":""}]
["成績書記載社名"]
[null,{"$f":"IF(ISBLANK(INDEX('②リスト(1つの機器につき1行ご記入下さい)'!B21:AD120,$C$3,20)),\"\",(INDEX('②リスト(1つの機器につき1行ご記入下さい)'!B21:AD120,$C$3,20)&\"(\"))","v":"■上記お客様名と同じ　□その他("},null,{"$f":"IF(ISBLANK(INDEX('②リスト(1つの機器につき1行ご記入下さい)'!B21:AD120,$C$3,21)),\")\",(INDEX('②リスト(1つの機器につき1行ご記入下さい)'!B21:AD120,$C$3,21)&\"　　)\"))","v":")"}]
["成績書記載部門名"]
[null,{"$f":"IF(ISBLANK(INDEX('②リスト(1つの機器につき1行ご記入下さい)'!B21:AD120,$C$3,22)),\"\",(INDEX('②リスト(1つの機器につき1行ご記入下さい)'!B21:AD120,$C$3,22)&\"　(\"))","v":"■不要　□必要　【　□上記部門名と同じ　□その他　("},null,null,{"$f":"IF(ISBLANK(INDEX('②リスト(1つの機器につき1行ご記入下さい)'!B21:AD120,$C$3,23)),\")】\",(INDEX('②リスト(1つの機器につき1行ご記入下さい)'!B21:AD120,$C$3,23)&\"　　)】\"))","v":")】"}]
["校正済ラベル（無料）"]
[null,{"$f":"IF(ISBLANK(INDEX('②リスト(1つの機器につき1行ご記入下さい)'!B21:AD120,$C$3,24)),\"\",(INDEX('②リスト(1つの機器につき1行ご記入下さい)'!B21:AD120,$C$3,24)&\"(\"))","v":"□不要　　■必要　【□６ヶ月　■１年　□２年　□その他("},null,null,{"$f":"IF(ISBLANK(INDEX('②リスト(1つの機器につき1行ご記入下さい)'!B21:AD120,$C$3,25)),\")】\",(INDEX('②リスト(1つの機器につき1行ご記入下さい)'!B21:AD120,$C$3,25)&\"　　)】\"))","v":")】"}]
["返却方法",null,null,null,null,"御希望納期"]
[null,{"$f":"IF(ISBLANK(INDEX('②リスト(1つの機器につき1行ご記入下さい)'!B21:AD120,$C$3,26)),\"\",(INDEX('②リスト(1つの機器につき1行ご記入下さい)'!B21:AD120,$C$3,26)&\"　(\"))","v":"■宅配便　□集配便　□その他　("},null,{"$f":"IF(ISBLANK(INDEX('②リスト(1つの機器につき1行ご記入下さい)'!B21:AD120,$C$3,27)),\")】\",(INDEX('②リスト(1つの機器につき1行ご記入下さい)'!B21:AD120,$C$3,27)&\"　　)】\"))","v":")】"},null,{"$f":"IF(ISBLANK(INDEX('②リスト(1つの機器につき1行ご記入下さい)'!B21:AD120,$C$3,28)),\"\",INDEX('②リスト(1つの機器につき1行ご記入下さい)'!B21:AD120,$C$3,28))","v":""}]
["不具合内容／特別返却先／備考"]
[null,{"$f":"IF(ISBLANK(INDEX('②リスト(1つの機器につき1行ご記入下さい)'!B21:AD120,$C$3,29)),\"\",INDEX('②リスト(1つの機器につき1行ご記入下さい)'!B21:AD120,$C$3,29))","v":""}]
[]
["　Ａ：京西テクノス株式会社（控）",null,null,null,null,null,"京西テクノス株式会社"]
[]
[]
[{"$f":"A7","v":"計測器／計量器校正・修理票 Ａ　【　　月】"},null,null,null,null,"作成年月日：",{"$f":"TODAY()","v":"2022-12-13"}]
["管理番号／登録番号",null,null,"御依頼内容"]
[null,{"$f":"B9","v":""},null,{"$f":"D9","v":"■校正　　□修理+校正　　□修理のみ"}]
[]
["品名",null,null,null,null,"メーカー名"]
[null,{"$f":"B12","v":""},null,null,null,{"$f":"F12","v":""}]
["型名／型式",null,null,"製造番号",null,"数量"]
[null,{"$f":"B14","v":""},null,{"$f":"D14","v":""},null,{"$f":"F14","v":""}]
["添付品"]
[null,{"$f":"B16","v":"■無　　□有　("},{"$f":"C16","v":")"}]
[]
["お客様名",null,null,null,null,"御担当者"]
{"$rows_left_out":28}